ermcenter.com

Home > Failed To

failed to load control imagelist from mscomctl ocx your version

symantec endpoint protection manager failed to connect to the server make sure

failed to register msscript.ocx

failed to validate certificate commvault

android exchange activesync failed to create the account

failed to configure management account

failed to update the cachefile contents in /var/cluster/run/hastorageplus/zfs

java failed to download required installation files windows 10

failed to unregistering spuninst exe for recovery

failed to call the odbc driver connection utility visual studio 2010

0x1760e077 failed to write sector

failed to find flength file phpmotion

failed to create the command line for xst

failed to get attributes of resolv.conf

failed to start video chat did not respond

failed to open the pdf file indesign

failed to set video mode half-life 2

failed to save to the destination store

failed to compile global shader fdofandbloomgatherfallbackpixelshader

failed to get speed and duplex bond0

failed to create com object php

battlefield bad company 2 failed to connect to ea online pc fix

failed to create instances of performance

error was [errno 14] peer cert cannot be verified or peer cert invalid

mbsa 2.3 failed to download security update databases

gmdx problem starting up steam

nvidia failed to initialize the nvidia kernel module centos

failed to identify the platform in use

acronis vss

failed to open virtual machine invalid access to memory location

windows failed to start a recent hardware

kali linux reaver warning failed to associate with

failed to create a proxy device for the usb device verr_pdm_no_usb_ports

the logon user interface dll ralinkgina.dll failed to load

user weblogic failed to be authenticated eclipse

failed to load entity data model tools package

org hibernate lazyinitializationexception failed to lazily initialize a collection of role spring

failed to initialize direct3d with current settings tomb raider

arcmap drawing errors one or more layers failed to draw

failed to join domain: failed to lookup dc info for domain over rpc: logon failure

gdb failed to set controlling terminal inappropriate ioctl for device

cs0121 the call is ambiguous between the following methods or properties

what is javahl

failed to establish connection with report server

failed to authenticate with google mac mail

vmware vmci bus device

failed to lazily initialize a collection of role hibernate

failed to remove drm signal handler

failed to send health notifications to the mcu factory

windows error recovery windows 7 failed to start

elasticsearch failed to send join request to master timeout waiting for task

failed to launch server application solidworks

failed to install .apk on device 'emulator-5554' timeout

failed to load module nvidia module does not exist

failed to add language monitor. (11) ricoh

failed to deliver commit message to the following targets

warning simplexml_load_file function simplexml load file

zerogu6: windows dll failed to load windows 10

failed to resolve dependencies android studio

dbus-uuidgen

autodesk inventor 2017 vba failed to initialize

failed to start daemon android studio

failed to verify message. could not retrieve certificate from mpcert.

failed to update system registry oracle discoverer

failed to load session ubuntu 11.10

ssis failed to acquire connection connection may not be configured correctly

failed to register asp net client scripts on this site

failed to create an ssl context php

failed to get size of gamma for output default virtualbox

failed to resolve hostname ts3

failed to contact game server half life

failed to build capture

e8535 failed to receive data from the agent exchange

vmware player failed to open virtual machine

failed to open socket on port

failed to decrypt protected xml node dts password key not valid

failed to parse xml-rpc request

failed to initialize zfs library freebsd

failed to load webapp in weblogic

failed to find in keytab

init failed to spawn rcs pre-start process

failed to open the connection crystal report business objects

msg: failed to get sainfo.

failed to initialize sound engine

failed to build vmnet. failed to execute the build command. ubuntu

failed to find an available report application server

msxml3.dll download

failed to set xfermode err_mask 0x1

veeam an unexpected network error occurred. failed to flush file buffers

only one element on document allowed

apt-get update failed to fetch 404

cannot run game failed to set up copy protection system

debootstrap error while installing kali

failed to execute the transaction to lwi admin 2

failed to initialize the graphical hardware devices

failed to open the connection. ~tmp

failed to write to disk moodle

failed to map the path iis

slim failed to execute login command freebsd

failed to locate a period of write inactivity

vnc viewer connection refused by host computer

failed to create part file emule

failed to enter the club home group

failed to enable constraints tableadapter

failed to create virtual serial port

failed to boot jboss java.lang.illegalstateexception incompletely deployed

failed to export the pdf file indesign cc

php copy failed to open stream permission denied

failed to login to brightstor arcserve backup database

failed to open the connection crystal report

failed to load or instantiate tagextrainfo class org.apache.struts.taglib.tiles

publisher 2013 failed to start correctly last time

/var/spool/squid/swap.state: (13) permission denied

ohs/bin/apachectl startssl execing httpd

failed to reset certificate request times 0x80041002

vmsvc warning guestinfo failed to get disk info

failed to abandon contract 55 permission denied

version node not found for symbol

failed to save aich hashset

failed to resolve the site id for sharepoint 2010

failed to create security context unlabeled

mqjms2005 reason 2009

failed to create d3d9 device rocket league

failed to enable service sunmc database

failed to create empty document windows 10

php move_uploaded_file failed to open stream

failed to open vcs cluster backup exec

alpine ca-certificates

failed to access iis metabase asp.net 2.0

sync session failed to start iphone 6

failed to start biztalk host instances

dsetup.dll download

cpanel ftp failed to retrieve directory listing

tmumh service

failed to find default engine.ini file to retrieve my documents subdirectory to use force quitting

failed to load the safecontrol assembly paths for web config

failed to load x11 frontend module slackware

failed to add signature

failed to write the message into the document outputstream

cannot find device eth0 ubuntu

failed to install catalog files windows xp sp3

java.lang.illegalstateexception failed to load applicationcontext spring junit maven

failed to mount snapshot before the smr operation

bamboo rest api example

could not bind to 127.0.0.1:9050: address already in use. is tor already running?

dell optiplex 780 failed to detect one or more drives during post

failed to load prereqchecker omil32.dll

failed to load the default scheme file the map views may be missing some visual elements

failed to send a usb control request

asp.net ajax client-side framework failed to load. 'sys' is undefined

failed to open interface.mpq

failed to run /usr/share/webmin/time/sync.pl

failed to install client disk i/o failure

failed to load socketxctl

failed to get basic authentication headers

failed to shmget for monitor 1

an extension failed to initialize outlook 2007 windows 7

failed to update firmware visit samsung service center

failed to find meta-inf/jboss-service.xml for archive jbossweb.sar

failed to load module egalax module requirement mismatch 0

pes 2013 failed to initialize fix

failed to establish a backside connection in datapower

hyper v virtual machine failed to start

php scandir not working

failed to create rmi registry

move_uploaded_file failed to open stream permission denied

failed to import media wordpress xml

failed to build sage.entity.interfaces.dll

mail() failed to connect to mailserver at localhost port 25 verify your smtp and smtp_port

failed to setup virtual adapter error 1205 windows 7

minecraft failed to bind to port hamachi

ubuntu join windows domain

problem: failed to create task or type for cause: the name is undefined.

failed to find or create sandbox directory

failed to create a settings from the text assembly references

failed to load control commondialog

appcelerator add a value for product_bundle_identifier in the build settings editor

1 file failed to validate and will be reacquired fix

wmi diagnosis utility

failed to run mkdumprd

module-alsa-card.c: failed to find a working profile.

failed to install sophos compliance agent

failed to set xfermode err_mask 0x40

failed to parse java_home setting

failed to compile audience 7113

unturned cannot find server

document failed to print hp

failed to load imap envelope javamail

error 1920 service failed to start

failed to init application object

ultravnc failed to connect to server windows 10

failed to sign bin debug app.publish setup.exe

warning include() failed opening for inclusion

failed to retrieve data from the database crystal reports

failed to send a2 command k850

14050 failed to register the service principal name 'hyper-v replica service'

failed to read sector reason no seek complete

sharepoint 2010 failed to find the xml file at location '14 template features

failed to load vbox runtime dll

failed to get configuration from anyconnect client process. contact your system administrator

crystal reports the rowset column could not be found

failed to initialize display driver wrapper msi afterburner

oifcfg getif prif-10: failed to initialize the cluster registry

at+egmr=1 7 at command is failed to send

service named start failed redhat

dolphin emulator pixel shader error fix

xenserver was unable to contact your domain server

failed to copy dsacls.exe from system folder

gssapi-keyex,gssapi-with-mic,publickey,keyboard-interactive

warning simplexml_load_file function simplexml load file i o warning failed to load external entity

java.lang.outofmemoryerror: failed to allocate android

how to fix windows failed to start without disc

systemctl failed to connect to bus: no such file or directory

failed to load the launcher dll cs go

failed to connect to sql database ssodb

/usr/bin/loadkeys failed with error code 1.

msiinstaller failed to connect to server. error: 0x800401f0

ora-27211 failed to load media management library netbackup

failed to start service "cluster" (servicestate=service_stopped, state_joining)

failed to run /usr/sbin/synaptic as user root

failed to get data for enablelua combofix

failed to update the system registry inpage 2009

failed to create key software

failed to register with ip office for voip operation

cannot open cube view essbase error 1054060

[smtp: failed to connect socket: connection refused (code: -1, response: )]

packer headless

failed to recognize subtitle type vlc

wlstexception: error occured while performing connect : user: weblogic, failed to be authenticated.

failed to load usb storage

failed to read censored word dictionary file

failed to configure the service netlogon as requested timeout

network camera view 4s software download

windows failed to start windows 7

425 can't open data connection filezilla

mbam.exe application error 0xc000001d

failed to start the database service mssql$sharepoint sharepoint 2010

failed to load in vmkernel

failed to bring up eth0 ubuntu 10.04

failed to load main-class manifest attribute from sample.jar

failed to read attribute msexchuseraccountcontrol exchange 2003

failed to open archive interface.mpq warmane

failed to read description. error code 2 windows 7

server tomcat v8.0 server at localhost failed to start in eclipse

failed to connect to wpa_supplicant - wpa_ctrl_open no such file or directory

steam failed to contact key server offline mode

failed to lock vertex buffer in cmeshdx8 lockvertexbuffer fix

failed to enable se_backup_privilege

failed to establish the default connection to the windowserver _cgsdefaultconnection

d3d9 download

slim failed to execute login command arch

failed to initialize the modeling engine

failed to read searchd response status=2610

failed to decrypt safe contents entry javax.crypto.badpaddingexception

failed to detect cd dvd or usb drive opensuse

steam_api.dll download free

failed to initialise the vadp configuration values

gconf error failed to contact configuration server redhat

mp did not find any locations matching with the site version.

vdp unable to establish connection to vcenter

failed to enumerate objects in the container access is denied server 2012 r2

failed to enumerate volumes macintosh hd library caches

failed to initialize vbox pagemaker

failed to enter common language runtime (clr) with hresult 0x80131022

failed to open address book database palm

failed to get available product info office 2007

response: 200 ok failed to create listen socket, aborting connection closed

veeam file does not exist vib

failed to initialize pes 2013

failed to build format texmf fmtutil format metafont cnf

failed to verify whole-file signature signature verification failed

failed to create virtual disk function not implemented

failed to read repository connection information

failed to update database txt_db error number 2 openvpn

failed to initialize winsock windows 98

failed to impersonate user with 5

failed to find meta-inf/jboss-service.xml for archive jboss-service.xml

failed to get game data from the server ios

failed to find an appropriate pixelformat

failed to build vdb cadence

failed to uncompress chrome archive

pacman database file for 'core' does not exist

failed to enable crypto composer

call "hostservicesystem.start" for object "servicesystem" on esxi failed.

failed to create required ocx control

failed to open stream connection refused file_get_contents

failed to enable the httpready

failed to update flash chips

failed to register user 841

failed to find steam the longest journey

failed to load module dri dri2 gentoo

isc-dhcp-server job failed to start

failed to load steamui.dll 2016

microsoft emulated ide controller failed to power on with error general access denied

blzbntagt00000843 overwatch

failed to open sdf file in read mode

failed to create game client window diablo 2

dovecot main process terminated with status 89

swtor stuck on initializing

failed to connect to server. error: 0x80070005 msiinstaller

fspsp04

could not locate the motif library in ld_library_path

failed to map vdisk local access denied

failed to add resources). change requests failed for some resources

failed to initialize directdraw result_surface fail

failed to alter spatial reference

fog failed to mount nfs volume network is unreachable

failed to initialize portal services caches

fileutils.copyfile example

failed to override connection autocommit /transaction isolation

file_get_contents failed to open stream error handling

failed to get lock using fcntl

failed to delay load library

failed to configure the service rpclocator as requested

adobe flash failed to register fix

failed to verify message. sending mp not in cached mplist.

failed to reconstruct target deflate chunk 1

failed to subscribe to local intel

failed to create d3d device left 4 dead 2 non steam

installation of product savxp failed

failed to create swap file '/vmfs/volumes/

failed to connect to database arcgis file geodatabase

asus firmware recovery

failed to download client files by bits. error 0x800704dd

failed to import bean definitions from url location classpath* applicationcontext.xml

eclipse failed to connect to remote vm. connection refused

failed to build dop for policy

nouveau failed to idle channel 0xcccc0000

failed to start monitoring file changes .net

wsimport failed to parse the wsdl

does not have any roots specified; the channel is being closed

could not obtain connection to any of these urls: localhost:1099

webspherewriterequestreadresponse: failed to find an app server to handle this request

64 bit eclipse

failed to delay load library mscorlib.dll

failed to get notification handle hr 8024002b

failed to assign serial number xsan

xkb couldn t compile keymap

failed to evaluate installed rule windowsupdate

failed to register driver for org.gjt.mm.mysql.driver

failed to load module vesa

failed to check for imgburn update

failed to mount /data (invalid argument) twrp

security accounts manager initialization failed server 2003

failed to create d3d device h1z1

failed to initialize gamemon darkeden

nmap "dnet: failed to open device ethx"

nitro pro 10 there is no creation process

failed to check for anti-phishing updates

'failed to set machine kerberos encryption types: insufficient access'

failed to create d3d device cs go

gtk-message: failed to load module "canberra-gtk-module" centos

smart pre-fail old age

crm 2011 failed to allocate a managed memory buffer

failed to transition from state_new to state_prepared on server

failed to read firewall configuration nod

failed to query crop capabilities /dev/video

failed to create subscription

failed to find a compatible gta online session containing friends

failed to access iis metabase. iis 5.1 asp.net 4.0

failed to execute method xml.ondata

failed to logon to sql server backup exec

unable to lock database manjaro

failed to create journal file provider esx 3.5

schema_reference.4: failed to read schema document

failed to initialize the sonic mapper server

arch wiki bumblebee

failed to launch server application mathcad 14

failed to read security descriptor attix

failed to archive log file to user exit

failed to load the game dll crysis crack

failed to open socket ejabberd

cleanflight failed to open serial port naze32

proc-26: error while accessing the physical storage

(os 5)access is denied. failed to open the apache2.2 service

failed to find flength

failed to initialize performance counter w3svc_w3wp

failed to load tunnel-dummy-vmc-plugin

(vsim-19) failed to access library 'work' at work

iptables-restore line failed commit

failed to open a source store

failed to query the needed interfaces for dvd playback

failed to resolve hostname teamspeak

before you can run vmware several modules must be compiled and loaded into the running kernel

dawn of war graphics configuration error

dvd decrypter failed to set data for dvddecrypterplaydvdmovieonarrival

cannot run game failed to set up graphics system fm 2016

failed to load hamachi configuration windows 7

racoon failed to get proposal for responder

chrome failed to load resource

php warning failed to open stream permission denied

mysql_select_db

failed to initialize mncs wine

java.net.sockettimeoutexception: failed to connect to retrofit

failed to connect to ftp server 21 wordpress

ubuntu failed to download repository information 2016

failed to load main-class manifest attribute from minecraft - server.jar

the detected items failed to store a record with error 80040230:mcefileioerror

ava failed to connect to server 2016

synergy failed to save autostart configuration access is denied

cms is not part of a cluster

invalidoperationexception failed to map the path

failed to parse/validate config: failed to bind one of the listener ports.

synology failed to install the file. the file is probably corrupted

failed to open stream: permission denied laravel

failed to validate the proxy address template

drupal failed to get available update data

wpa_supplicant exited with return code 1

failed to lock the file vmdk

failed to load the internet connection wizard helper components

failed to initialize monitor device vmware fusion

failed to global.cki

failed to query the needed interfaces for playback mpc

error during ssl handshake with remote server returned by

failed to set the boot flag on /dev/mapper/arch_root-image

failed to initialize remote connection

failed to parse test result file failsafe-summary.xml

failed to deploy artifacts could not transfer artifact 400

failed to configure the boot camp partition

failed to connect to backup manager web service

failed to initialize because a suitable

failed to link libclntsh so 11.1

failed to set video mode motogp

failed to load preferences cisco anyconnect

handle_request_invite: failed to authenticate device

failed to connect to hp alm sprinter

org.slf4j.impl.staticloggerbinder jar

component 'flash.ocx' or one of its dependencies not correctly registered

failed to query spn

failed to create crystal database connector

installation failure: windows failed to install the following update with error 0x800f0826

failed to connect to database version not found sde.default

upstart start: job failed to start

failed to get public key from docbase

failed to create a graphics device europa universalis 4

failed to generate a user instance of sql server visual studio 2008

extundelete: failed to read-only open device "/dev/sda1": error code 2133571347

failed to start the virtual machine (error -18)

norton 360 liveupdate failed to complete

failed to configure the service netlogon as requested timed out

failed to open the mpeg encoder ulead

failed to get patch patchlist txt

file_put_contents failed to open stream: invalid argument

windows could not start the sonarqube service on local computer

obs failed to initialize video windows 7

xfce failed to execute default web browser

a general system error occurred migration to host failed with error already disconnected (0xbad002e)

download msizap

failed to copy debugfs permission denied

failed to load resource dll teamviewer

failed to install service winexesvc - nt_status_unsuccessful

failed to get write lock

failed to alter database #mysql50#.snap upgrade data directory name

failed to set metamode 1

failed to uninstall the device may be required to boot

failed to initialize server object invalid class string

failed to connect to host two worlds 2

failed to enter nvidialogo ut2

failed to get speed and duplex from

failed to find gid for group openvpn

failed to create mutex for ms odbc perf file mapping

server tcp provider failed to listen on [ 'any' 1433]. tcp port is already in use.

failed to start transfer vm. there was a failure communicating with the plugin.

failed to create phonebook entry reliance netconnect

failed to update the system registry scientific workplace

failed to connect to server (code 1006) digitalocean

failed to get player information from the server pokemon go

hwclock cannot open /dev/rtc no such file or directory

failed to initialize cooltype mac photoshop

rsync failed to set permissions

darkxl download

failed to add windir winsxs pending.xml

skyrim failed to initialize renderer unknown error creating the renderer

ws_common: websphereupdateconfig: failed parsing the plugin config file

cmd failed to connect to registry 1326

failed to find meta-inf/jboss-service.xml for archive hornetq.sar

failed to initialize emm connection on master server

failed to start server cannot bind address

microsoft baseline security analyzer 2.3 failed to download security update databases

failed to read sector no seek complete imgburn

failed to retrieve list schema

failed to report child abuse

failed to load database information crystal reports visual studio 2013

visual studio 2015 cannot publish because a project failed to build

failed to create memory contents file hyper-v

failed to install acpi driver

cabal na

failed to execute child process nm vpn properties

vmware failed to build vmmon

ubuntu failed to load session gnome

aspi32 service

warning mail() function.mail failed to connect to mailserver at localhost port 25 verify your smtp

failed to open a session for the virtual machine kali linux

failed to install the plug-in file aaffmt.dll

failed to load delzip179.dll

vlog 7 error

failed to trigger software inventory cycle

failed to find service bluetooth file transfer

acronis failed to create volume snapshot

failed to transmit blackberry ioexception

 First - 1  - 2  - 3 - Last