ermcenter.com

Home > Return Code > Error Deploying Artifact Failed To Transfer File Return Code Is 400

Error Deploying Artifact Failed To Transfer File Return Code Is 400

Contents

I've never used curl before, so I'm at a loss on what to do with this information. You also get an error (and off the top of my head is also a 401) if you try to publish something to a releases repository and that version already exists maven-3 artifactory share|improve this question edited Dec 27 '13 at 8:53 asked Dec 26 '13 at 17:09 Eric Han 5317 You should check the Artifactory access log. How can "USB stick" online identification possibly work? check over here

Since the 401 Unauthorized error is nebulous and unhelpful--and is normally associated to user/pass problems--it's no surprise that I was unable to figure this out on my own. Output: [INFO] Scanning for projects... [INFO] [INFO] ------------------------------------------------------------------------ [INFO] Building XBN-Java 0.1.3 [INFO] ------------------------------------------------------------------------ [INFO] [INFO] --- build-helper-maven-plugin:1.8:attach-artifact (attach-artifacts) @ xbnjava --- [INFO] [INFO] --- maven-install-plugin:2.4:install (default-install) @ xbnjava --- [INFO] What am I doing wrong? Solved my issue –Dhiral Pandya Jun 26 '15 at 10:55 Worked for me too! –Igor Baiborodine Mar 16 '16 at 20:24 add a comment| up vote 2 down vote

Error Deploying Artifact Failed To Transfer File Return Code Is 400

at org.apache.maven.lifecycle.internal.MojoExecutor.execute(MojoExecutor.java:216) ---------------------------------------------------------------------------------------------------------- Here is POM.xml 4.0.0 org.bhavesh my-test 1.0-SNAPSHOT jar my-test http://maven.apache.org UTF-8 junit junit 3.8.1 test What are the benefits of an oral exam? The SNAPSHOTS repository (as opposed to the releases repository) allows you to overwrite a similarly numbered version, but your version number should have "-SNAPSHOT" at the end of it.

Troubleshooting Artifact Download Failures Nexus Logging Guide Tips for uploading very large files to Nexus Nexus Repository Manager 3.0 (Milestone 6 Release) Terms of ServicePrivacy PolicyCopyright © 2008-present, Sonatype Inc. Without more details, it's pretty hard to tell what's going wrong. Or it's merely an ordinary mistake? Nexus Failed To Transfer File Return Code Is 401 Reasonphrase Unauthorized It will show the 401 along the username.

Why would two species of predator with the same prey cooperate? Artifactory Return Code Is: 401, Reasonphrase: Unauthorized Return code is: 401 at org.sonatype.aether.connector.wagon.WagonRepositoryConnector$4.wrap(WagonRepositoryConnector.java:951) at org.sonatype.aether.connector.wagon.WagonRepositoryConnector$4.wrap(WagonRepositoryConnector.java:939) at org.sonatype.aether.connector.wagon.WagonRepositoryConnector$PutTask.run(WagonRepositoryConnector.java:837) at org.sonatype.aether.connector.wagon.WagonRepositoryConnector.put(WagonRepositoryConnector.java:467) at org.sonatype.aether.impl.internal.DefaultDeployer.deploy(DefaultDeployer.java:274) ... 26 more Caused by: org.apache.maven.wagon.TransferFailedException: Failed to transfer file: http://192.168.1.16:8081/artifactory/libs-snapshot-local/sg/com/pinder/pinder/0.0.1-SNAPSHOT/pinder-0.0.1-20131227.084815-1.jar. check if the password is still valid! Then login to Nexus as an admin and look what permissions are set.

When was today's radar measurement of the Earth-Sun distance made and by who? Maven Deploy Username Password Powered by Blogger. Terms of Service Privacy Policy Copyright© 2008-present, Sonatype Inc. The second common reason for this code is that you are trying to deploy a release artifact into a snapshot repository, or vice versa.

Artifactory Return Code Is: 401, Reasonphrase: Unauthorized

Note that this code is returned after the artifact upload has completed, so it can be a bit confusing. https://support.sonatype.com/hc/en-us/articles/213464668-Troubleshooting-Artifact-Deployment-Failures Code 400 - Method not Allowed Nexus has received your deployment request but cannot process it because it is invalid. Error Deploying Artifact Failed To Transfer File Return Code Is 400 Apparently I have specified -DrepositoryID (note ID in capital) instead of -DrepositoryId. Return Code Is 401 Reasonphrase Unauthorized. Nexus Permalink Article is closed for comments.

Are there any rules of thumb for the most comfortable seats on a long distance bus? check my blog Return code is: 401, ReasonPhrase: Unauthorized. What are the key differences between the Stolen Valor Act of 2005 and the Stolen Valor Act of 2013? Send to Email Address Your Name Your Email Address Cancel Post was not sent - check your email addresses! Failed To Deploy Artifacts Could Not Transfer Artifact Return Code Is 400 Reasonphrase Bad Request

The project's settings: Checklist item 3. Return code is: 401, ReasonPhrase: Unauthorized. -> [Help 1] dkayiwa (Daniel Kayiwa) 2015-08-06 13:56:29 UTC #2 Did you check out the troubleshooting section at the bottom of this page? at org.apache.maven.lifecycle.internal.MojoExecutor.execute(MojoExecutor.java:216) at org.apache.maven.lifecycle.internal.MojoExecutor.execute(MojoExecutor.java:153) at org.apache.maven.lifecycle.internal.MojoExecutor.execute(MojoExecutor.java:145) at org.apache.maven.lifecycle.internal.LifecycleModuleBuilder.buildProject(LifecycleModuleBuilder.java:116) at org.apache.maven.lifecycle.internal.LifecycleModuleBuilder.buildProject(LifecycleModuleBuilder.java:80) at org.apache.maven.lifecycle.internal.builder.singlethreaded.SingleThreadedBuilder.build(SingleThreadedBuilder.java:51) at org.apache.maven.lifecycle.internal.LifecycleStarter.execute(LifecycleStarter.java:120) at org.apache.maven.DefaultMaven.doExecute(DefaultMaven.java:347) at org.apache.maven.DefaultMaven.execute(DefaultMaven.java:154) at org.apache.maven.cli.MavenCli.execute(MavenCli.java:584) at org.apache.maven.cli.MavenCli.doMain(MavenCli.java:213) at org.apache.maven.cli.MavenCli.main(MavenCli.java:157) at sun.reflect.NativeMethodAccessorImpl.invoke0(Native Method) at sun.reflect.NativeMethodAccessorImpl.invoke(NativeMethodAccessorImpl.java:57) at sun.reflect.DelegatingMethodAccessorImpl.invoke(DelegatingMethodAccessorImpl.java:43) this content Join them; it only takes a minute: Sign up Return Code 401 with Maven 3 uploading SNAPSHOT to Artifactory up vote 0 down vote favorite 1 I am running the following:

If credentials were sent there will be an entry in the feed. Error Deploying Artifact Failed To Transfer File Return Code Is 500 Return code is: 401 at org.apache.maven.plugin.deploy.DeployMojo.execute(DeployMojo.java:193) at org.apache.maven.plugin.DefaultBuildPluginManager.executeMojo(DefaultBuildPluginManager.java:101) at org.apache.maven.lifecycle.internal.MojoExecutor.execute(MojoExecutor.java:209) ... 19 more Caused by: org.apache.maven.artifact.deployer.ArtifactDeploymentException: Failed to deploy artifacts: Could not transfer artifact sg.com.pinder:pinder:jar:0.0.1-20131227.084815-1 from/to ServerA2 (http://192.168.1.16:8081/artifactory/libs-snapshot-local): Failed to transfer You can post the relevant ones here for more opinions. [OCA 8 book] [OCP 8 book] [Blog] [JavaRanch FAQ] [How To Ask Questions The Smart Way] [Book Promos] Other Certs: SCEA

This is a network issue that your IT staff may need to help you solve.

Return code is: 401 -> [Help 1] Please help me. I am just hitting wall after wall with Maven. As a result, I've received many questions from users, and a large amount of them is about '401'. Mng-4469 Although it said that it was an authentication error actually it got fixed doing a "rebuild metadata" in the nexus repository.

This may happen unconsciously when the name in the email address is the same as the user name. If this HTTPS server uses a certificate signed by a CA represented in the bundle, the certificate verification probably failed due to a problem with the certificate (it might be expired, maven nexus share|improve this question edited Dec 13 '13 at 15:30 asked Dec 13 '13 at 15:24 Gangaraju 1,49151345 Failed to transfer file: http://localhost:8080/nexus/content/repositories/snapshots/t‌estproject/testproje‌ct/1.0-SNAPSHOT/test‌project-1.0-20131213‌.150615-1.jar. have a peek at these guys I successfully logged in and out of the sonatype.org website, using the user/pass in settings.xml.

share|improve this answer answered Nov 18 '14 at 13:34 betty 317 I got the same "Could not find metadata" debug message but the actual error was another one: I XBN-Java is the foundation of Codelet (http://codelet.aliteralmind.com). org.sonatype.oss oss-parent 7 Lesser General Public License (LGPL) version 3.0 https://www.gnu.org/licenses/lgpl-3.0.txt Apache Software License (ASL) version 2.0 http://www.apache.org/licenses/LICENSE-2.0.txt share|improve this answer edited Jul 18 '14 at 22:40 answered Jul 18 '14 at 19:34 aliteralmind 11.1k63971 add a comment| up vote 0 down vote I had the same error. Steven_Emmerson (Steven Emmerson) 2012-06-28 23:21:00 UTC #3 Here's the exception that caused the problem: Caused by: org.apache.maven.wagon.TransferFailedException: Failed to transfer file: https://artifacts.unidata.ucar.edu/content/repositories/unidata-snapshots/edu/ucar/unidata/sruth/1.0-SNAPSHOT/sruth-1.0-20120628.231243-32.jar.

Need to edit $M2_HOME/conf/settings.xml instead of /home/user/.m2/settings.xml share|improve this answer answered Dec 15 '13 at 10:33 Gangaraju 1,49151345 1 That indicates that you were running the maven execution as a JBoss In Action Bob pat Greenhorn Posts: 7 posted 2 years ago HI Peter, My setting files at my home directory. The Artifact was uploaded successfully But I encounter the following error when I set the version in pom.xml to 1.0-SNAPSHOT Output from mvn clean deploy -X -e [INFO] --- maven-deploy-plugin:2.7:deploy (default-deploy)